Reaction Details
TargetPlatelet-derived growth factor receptor beta
LigandBDBM139621
Substrate/Competitorn/a
Meas. Tech.Kinase Assay
Ki 15.0±n/a nM
Citation Hull, III, CEMalone, TC Method of treating conditions with kinase inhibitors US Patent US9820989 Publication Date 11/21/2017
 
Platelet-derived growth factor receptor beta
Name:Platelet-derived growth factor receptor beta
Type:Enzyme
Mol. Mass.:123922.25
Organism:Homo sapiens (Human)
Description:P09619
Residue:1106
BDBM139621
NameBDBM139621
Synonyms:US8889870, 169 US9820989, 169
TypeSmall organic molecule
Emp. Form.C26H27N3O3
Mol. Mass.429.5109
SMILESCOC(=O)c1cncc2CN(CCc12)c1cccc(c1)C(=O)Nc1cccc(c1)C(C)C