Reaction Details
TargetVascular endothelial growth factor receptor 2
LigandBDBM139624
Substrate/Competitorn/a
Meas. Tech.Kinase Assay
Ki 367±n/a nM
Citation Hull, III, CEMalone, TC Method of treating conditions with kinase inhibitors US Patent US9820989 Publication Date 11/21/2017
 
Vascular endothelial growth factor receptor 2
Name:Vascular endothelial growth factor receptor 2
Type:Receptor Tyrosine Kinase
Mol. Mass.:151510.97
Organism:Homo sapiens (Human)
Description:P35968
Residue:1356
BDBM139624
NameBDBM139624
Synonyms:US8889870, 172 US9820989, 172
TypeSmall organic molecule
Emp. Form.C32H39N5O3
Mol. Mass.541.6838
SMILESCC(C)c1cccc(NC(=O)c2cccc(c2)N2CCc3c(C2)cncc3C(=O)NCCCN2CCOCC2)c1