Reaction Details
TargetPlatelet-derived growth factor receptor beta
LigandBDBM139628
Substrate/Competitorn/a
Meas. Tech.Kinase Assay
Ki 61.0±n/a nM
Citation Hull, III, CEMalone, TC Method of treating conditions with kinase inhibitors US Patent US9820989 Publication Date 11/21/2017
 
Platelet-derived growth factor receptor beta
Name:Platelet-derived growth factor receptor beta
Type:Enzyme
Mol. Mass.:123922.25
Organism:Homo sapiens (Human)
Description:P09619
Residue:1106
BDBM139628
NameBDBM139628
Synonyms:US8889870, 176 US9820989, 176
TypeSmall organic molecule
Emp. Form.C21H17F4N5O
Mol. Mass.431.3862
SMILESNc1ncc2CN(CCc2n1)c1cccc(c1)C(=O)Nc1ccc(F)c(c1)C(F)(F)F