Reaction Details
TargetBifunctional dihydrofolate reductase-thymidylate synthase
LigandBDBM18776
Substrate/CompetitorBDBM18044
Meas. Tech.Inhibitor Screening Using Bacterial System (IC50) and Measurement of Inhibition Constant (Ki)
pH7±n/a
Temperature298.15±n/a K
Ki 1.40±0.17 nM
IC50 220±50 nM
Citation Bunyarataphan, SLeartsakulpanich, UTaweechai, STarnchompoo, BKamchonwongpaisan, SYuthavong, Y Evaluation of the activities of pyrimethamine analogs against Plasmodium vivax and Plasmodium falciparum dihydrofolate reductase-thymidylate synthase using in vitro enzyme inhibition and bacterial complementation assays. Antimicrob Agents Chemother50:3631-7 (2006) 
 
Bifunctional dihydrofolate reductase-thymidylate synthase
Name:Bifunctional dihydrofolate reductase-thymidylate synthase
Type:Enzyme
Mol. Mass.:71083.97
Organism:Plasmodium vivax (malaria parasite P. vivax)
Description:O02604
Residue:623
BDBM18776
BDBM18044
NameBDBM18776
Synonyms:5-(4-chlorophenyl)-6-(2-methylpropyl)pyrimidine-2,4-diamine
TypeSmall organic molecule
Emp. Form.C14H17ClN4
Mol. Mass.276.765
SMILESCC(C)Cc1nc(N)nc(N)c1-c1ccc(Cl)cc1