Reaction Details
TargetBifunctional dihydrofolate reductase-thymidylate synthase
LigandBDBM18784
Substrate/CompetitorBDBM18044
Meas. Tech.Inhibitor Screening Using Bacterial System (IC50) and Measurement of Inhibition Constant (Ki)
pH7±n/a
Temperature298.15±n/a K
Ki 0.31±0.07 nM
IC50 360±100 nM
Citation Bunyarataphan, SLeartsakulpanich, UTaweechai, STarnchompoo, BKamchonwongpaisan, SYuthavong, Y Evaluation of the activities of pyrimethamine analogs against Plasmodium vivax and Plasmodium falciparum dihydrofolate reductase-thymidylate synthase using in vitro enzyme inhibition and bacterial complementation assays. Antimicrob Agents Chemother50:3631-7 (2006) 
 
Bifunctional dihydrofolate reductase-thymidylate synthase
Name:Bifunctional dihydrofolate reductase-thymidylate synthase
Type:Enzyme
Mol. Mass.:71083.97
Organism:Plasmodium vivax (malaria parasite P. vivax)
Description:O02604
Residue:623
BDBM18784
BDBM18044
NameBDBM18784
Synonyms:5-(3-chlorophenyl)-6-ethylpyrimidine-2,4-diamine P30
TypeSmall organic molecule
Emp. Form.C12H13ClN4
Mol. Mass.248.711
SMILESCCc1nc(N)nc(N)c1-c1cccc(Cl)c1