Reaction Details
TargetBifunctional dihydrofolate reductase-thymidylate synthase
LigandBDBM18787
Substrate/CompetitorBDBM18044
Meas. Tech.Inhibitor Screening Using Bacterial System (IC50) and Measurement of Inhibition Constant (Ki)
pH7±n/a
Temperature298.15±n/a K
Ki 0.63±0.06 nM
IC50 2270±650 nM
Citation Bunyarataphan, SLeartsakulpanich, UTaweechai, STarnchompoo, BKamchonwongpaisan, SYuthavong, Y Evaluation of the activities of pyrimethamine analogs against Plasmodium vivax and Plasmodium falciparum dihydrofolate reductase-thymidylate synthase using in vitro enzyme inhibition and bacterial complementation assays. Antimicrob Agents Chemother50:3631-7 (2006) 
 
Bifunctional dihydrofolate reductase-thymidylate synthase
Name:Bifunctional dihydrofolate reductase-thymidylate synthase
Type:Enzyme
Mol. Mass.:71083.97
Organism:Plasmodium vivax (malaria parasite P. vivax)
Description:O02604
Residue:623
BDBM18787
BDBM18044
NameBDBM18787
Synonyms:5-(3-chlorophenyl)-6-[2-(3-phenoxypropoxy)ethyl]pyrimidine-2,4-diamine P40
TypeSmall organic molecule
Emp. Form.C21H23ClN4O2
Mol. Mass.398.886
SMILESNc1nc(N)c(c(CCOCCCOc2ccccc2)n1)-c1cccc(Cl)c1