Reaction Details
TargetBifunctional dihydrofolate reductase-thymidylate synthase [1-238,S58R,S117N]
LigandBDBM18791
Substrate/CompetitorBDBM18044
Meas. Tech.Inhibitor Screening Using Bacterial System (IC50) and Measurement of Inhibition Constant (Ki)
Ki 0.81±n/a nM
IC50 2760±n/a nM
Citation Bunyarataphan, SLeartsakulpanich, UTaweechai, STarnchompoo, BKamchonwongpaisan, SYuthavong, Y Evaluation of the activities of pyrimethamine analogs against Plasmodium vivax and Plasmodium falciparum dihydrofolate reductase-thymidylate synthase using in vitro enzyme inhibition and bacterial complementation assays. Antimicrob Agents Chemother50:3631-7 (2006) 
 
Bifunctional dihydrofolate reductase-thymidylate synthase [1-238,S58R,S117N]
Name:Bifunctional dihydrofolate reductase-thymidylate synthase [1-238,S58R,S117N]
Type:Enzyme
Mol. Mass.:27235.37
Organism:Plasmodium vivax (malaria parasite P. vivax)
Description:O02604[1-238,S58R,S117N]
Residue:238
BDBM18791
BDBM18044
NameBDBM18791
Synonyms:5-phenyl-6-(3-phenylpropyl)pyrimidine-2,4-diamine P33
TypeSmall organic molecule
Emp. Form.C19H20N4
Mol. Mass.304.3889
SMILESNc1nc(N)c(-c2ccccc2)c(CCCc2ccccc2)n1