Reaction Details
TargetAlpha-1,6-mannosyl-glycoprotein 2-beta-N-acetylglucosaminyltransferase
LigandBDBM235244
Substrate/Competitorn/a
Meas. Tech.LCMS Assay
IC50 1.000±n/a nM
Citation Ahmad, SNegash, LA Dihydropyridinone MGAT2 inhibitors US Patent US9822074 Publication Date 11/21/2017
 
Alpha-1,6-mannosyl-glycoprotein 2-beta-N-acetylglucosaminyltransferase
Name:Alpha-1,6-mannosyl-glycoprotein 2-beta-N-acetylglucosaminyltransferase
Type:n/a
Mol. Mass.:51567.80
Organism:Homo sapiens (Human)
Description:Q10469
Residue:447
BDBM235244
NameBDBM235244
Synonyms:US9365558, 67 | US9822074, 67
TypeSmall organic molecule
Emp. Form.C27H25F9N2O5S
Mol. Mass.660.548
SMILESCS(=O)(=O)NC(=O)C1=C(C[C@](NC1=O)(c1ccc(OCCCCCC(F)(F)F)cc1F)C(F)(F)F)c1ccc(cc1)C(F)F