Reaction Details
TargetThymidylate synthase
LigandBDBM18794
Substrate/CompetitorBDBM18754
Meas. Tech.Dihydrofolate Reductase (DHFR) Assay
IC50>180000±n/a nM
Citation Gangjee, ALin, XKisliuk, RLMcGuire, JJ Synthesis of N-{4-[(2,4-diamino-5-methyl-4,7-dihydro-3H-pyrrolo[2,3-d]pyrimidin-6-yl)thio]benzoyl}-L-glutamic acid and N-{4-[(2-amino-4-oxo-5-methyl-4,7-dihydro-3H-pyrrolo[2,3-d]pyrimidin-6-yl)thio]benzoyl}-L-glutamic acid as dual inhibitors of dihydrofolate reductase and thymidylate synthase and a J Med Chem48:7215-22 (2005) 
 
Thymidylate synthase
Name:Thymidylate synthase
Type:Enzyme
Mol. Mass.:30475.81
Organism:Escherichia coli
Description:n/a
Residue:264
BDBM18794
BDBM18754
NameBDBM18794
Synonyms:(2S)-2-{[4-({2-amino-5-methyl-4-oxo-3H,4H,7H-pyrrolo[2,3-d]pyrimidin-6-yl}sulfanyl)phenyl]formamido}pentanedioic acid | pyrrolo[2,3-d]pyrimidine scaffold, 4
TypeSmall organic molecule
Emp. Form.C19H19N5O6S
Mol. Mass.445.449
SMILESCc1c(Sc2ccc(cc2)C(=O)N[C@@H](CCC(O)=O)C(O)=O)[nH]c2nc(N)[nH]c(=O)c12