Reaction Details
TargetEnvelope glycoprotein gp160
LigandBDBM235036
Substrate/Competitorn/a
Meas. Tech.HIV cell culture assay
EC50>100±n/a nM
Citation Chen, JChen, YMeanwell, NARegueiro-Ren, ASin, NSit, S C17-aryl substituted betulinic acid analogs US Patent US10047118 Publication Date 8/14/2018
 
Envelope glycoprotein gp160
Name:Envelope glycoprotein gp160
Type:n/a
Mol. Mass.:97241.93
Organism:Human immunodeficiency virus type 1 group M subtype B (isolate HXB2)
Description:n/a
Residue:856
BDBM235036
NameBDBM235036
Synonyms:4-((1R,3aS,5aR,5bR,7aR,11aS,11bR,13aR,13bR)-5a,5b,8,8,11a-pentamethyl-3a-(1,3,4-oxadiazol-2-yl)-1-(prop-1-en-2-yl)-2,3,3a,4,5,5a,5b,6,7,7a,8,11,11a,11b,12,13,13a,13b-octadecahydro-1H-cyclopenta[a]chrysen-9-yl)benzoic acid | US10047118, 3
TypeSmall organic molecule
Emp. Form.C38H50N2O3
Mol. Mass.582.8152
SMILESCC(=C)[C@@H]1CC[C@@]2(CC[C@]3(C)[C@H](CC[C@@H]4[C@@]5(C)CC=C(c6ccc(cc6)C(O)=O)C(C)(C)[C@@H]5CC[C@@]34C)[C@@H]12)c1nnco1