Reaction Details
TargetThyroid hormone receptor alpha
LigandBDBM18881
Substrate/CompetitorBDBM18860
Meas. Tech.TRalpha-Binding Assay and Thyroid Response Element (TRAFalpha1) Reporter Assay.
pH7±n/a
Temperature277.15±n/a K
IC50 670±50 nM
EC50 65±n/a nM
Citation Garg, NLi, YLGarcia Collazo, AMLitten, CRyono, DEZhang, MCaringal, YBrigance, RPMeng, WWashburn, WNAgback, PMellström, KRehnmark, SRahimi-Ghadim, MNorin, TGrynfarb, MSandberg, JGrover, GMalm, J Thyroid receptor ligands. Part 8: Thyromimetics derived from N-acylated-alpha-amino acid derivatives displaying modulated pharmacological selectivity compared with KB-141. Bioorg Med Chem Lett17:4131-4 (2007) 
 
Thyroid hormone receptor alpha
Name:Thyroid hormone receptor alpha
Type:Receptor
Mol. Mass.:54818.00
Organism:Homo sapiens (Human)
Description:Recombinant hThR was obtained from nuclear extracts from SF9 cells infected with baculovirus vectors encoding for ThRalpha 1.
Residue:490
BDBM18881
BDBM18860
NameBDBM18881
Synonyms:(2S)-2-(1-{3,5-dibromo-4-[3-chloro-4-hydroxy-5-(propan-2-yl)phenoxy]phenyl}acetamido)-3-methylbutanoic acid | N-acylated-alpha-amino acid derivative, 9
TypeSmall organic molecule
Emp. Form.C22H24Br2ClNO5
Mol. Mass.577.691
SMILESCC(C)[C@H](NC(=O)Cc1cc(Br)c(Oc2cc(Cl)c(O)c(c2)C(C)C)c(Br)c1)C(O)=O