Reaction Details
TargetThyroid hormone receptor beta
LigandBDBM18860
Substrate/CompetitorBDBM18860
Meas. Tech.TRbeta-Binding Assay
pH7±n/a
Temperature277.15±n/a K
IC50 0.26±n/a nM
Citation Li, YLLitten, CKoehler, KFMellström, KGarg, NGarcia Collazo, AMFärnegård, MGrynfarb, MHusman, BSandberg, JMalm, J Thyroid receptor ligands. Part 4: 4'-amido bioisosteric ligands selective for the thyroid hormone receptor beta. Bioorg Med Chem Lett16:884-6 (2006) 
 
Thyroid hormone receptor beta
Name:Thyroid hormone receptor beta
Type:Receptor
Mol. Mass.:52793.62
Organism:Homo sapiens (Human)
Description:Recombinant hThR was obtained from nuclear extracts from SF9 cells infected with baculovirus vectors encoding for ThRbeta 1.
Residue:461
BDBM18860
BDBM18860
NameBDBM18860
Synonyms:(2R)-2-amino-3-[4-(4-hydroxy-3-iodophenoxy)-3,5-diiodophenyl]propanoic acid 3,5,3'-triiodo-L-thyronine (T3) Triiodothyronine US10544075, Compound T3 liothyronine | triothyrone
TypeHormone
Emp. Form.C15H12I3NO4
Mol. Mass.650.9735
SMILESN[C@@H](Cc1cc(I)c(Oc2ccc(O)c(I)c2)c(I)c1)C(O)=O