Reaction Details
TargetGlutamate receptor ionotropic, NMDA 2B
LigandBDBM235340
Substrate/Competitorn/a
Meas. Tech.FDSS Assay
IC50 23.7±n/a nM
Citation Anderson, DRVolkmann, RAMenniti, FS Selective octahydro-cyclopenta[C] pyrrole negative modulators of NR2B US Patent US10052306 Publication Date 8/21/2018
 
Glutamate receptor ionotropic, NMDA 2B
Name:Glutamate receptor ionotropic, NMDA 2B
Type:PROTEIN
Mol. Mass.:166375.46
Organism:Homo sapiens (Human)
Description:ChEMBL_1438829
Residue:1484
BDBM235340
NameBDBM235340
Synonyms:(3aR,5R,6aS)-5-benzyl-2- ((R)-2-hydroxy-2-(4- hydroxyphenyl)ethyl)octa- hydrocyclopenta[c]pyrrol- 5-ol US10052306, 142
TypeSmall organic molecule
Emp. Form.C22H27NO3
Mol. Mass.353.4547
SMILESO[C@@H](CN1C[C@H]2C[C@](O)(Cc3ccccc3)C[C@H]2C1)c1ccc(O)cc1