Reaction Details
TargetGlutamate receptor ionotropic, NMDA 2B
LigandBDBM237552
Substrate/Competitorn/a
Meas. Tech.FDSS Assay
IC50 11.5±n/a nM
Citation Anderson, DRVolkmann, RAMenniti, FS Selective octahydro-cyclopenta[C] pyrrole negative modulators of NR2B US Patent US10052306 Publication Date 8/21/2018
 
Glutamate receptor ionotropic, NMDA 2B
Name:Glutamate receptor ionotropic, NMDA 2B
Type:PROTEIN
Mol. Mass.:166375.46
Organism:Homo sapiens (Human)
Description:ChEMBL_1438829
Residue:1484
BDBM237552
NameBDBM237552
Synonyms:US10052306, 223 | rac-(3aR,5r,6aS)-5-(4- chlorobenzyl)-2-(2- hydroxy-2-(5- hydroxypyridin-2- yl)ethyl)octahydrocyclo- penta[c]pyrrol-5-ol
TypeSmall organic molecule
Emp. Form.C21H25ClN2O3
Mol. Mass.388.888
SMILESOC(CN1C[C@H]2C[C@](O)(Cc3ccc(Cl)cc3)C[C@H]2C1)c1ccc(O)cn1