Reaction Details
TargetGlutamate receptor ionotropic, NMDA 2B
LigandBDBM237683
Substrate/Competitorn/a
Meas. Tech.FDSS Assay
IC50 15.5±n/a nM
Citation Anderson, DRVolkmann, RAMenniti, FS Selective octahydro-cyclopenta[C] pyrrole negative modulators of NR2B US Patent US10052306 Publication Date 8/21/2018
 
Glutamate receptor ionotropic, NMDA 2B
Name:Glutamate receptor ionotropic, NMDA 2B
Type:PROTEIN
Mol. Mass.:166375.46
Organism:Homo sapiens (Human)
Description:ChEMBL_1438829
Residue:1484
BDBM237683
NameBDBM237683
Synonyms:US10052306, 229 | rac-(3aR,5r,6aS)-5-(2- fluorobenzyl)-2-(2- hydroxy-2-(4-hy- droxyphenyl)ethyl)octa- hydrocyclopenta[c] pyrrol-5-ol
TypeSmall organic molecule
Emp. Form.C22H26FNO3
Mol. Mass.371.4451
SMILESOC(CN1C[C@H]2C[C@](O)(Cc3ccccc3F)C[C@H]2C1)c1ccc(O)cc1