Reaction Details
TargetGlutamate receptor ionotropic, NMDA 2B
LigandBDBM238865
Substrate/Competitorn/a
Meas. Tech.FDSS Assay
IC50 16.8±n/a nM
Citation Anderson, DRVolkmann, RAMenniti, FS Selective octahydro-cyclopenta[C] pyrrole negative modulators of NR2B US Patent US10052306 Publication Date 8/21/2018
 
Glutamate receptor ionotropic, NMDA 2B
Name:Glutamate receptor ionotropic, NMDA 2B
Type:PROTEIN
Mol. Mass.:166375.46
Organism:Homo sapiens (Human)
Description:ChEMBL_1438829
Residue:1484
BDBM238865
NameBDBM238865
Synonyms:US10052306, 304 | rac-4-{2-[(3aR,5S,6aS)- 5-benzyl- octahydrocyclopenta[c] pyrrol-2-yl]-1- hydroxyethyl}phenol
TypeSmall organic molecule
Emp. Form.C22H27NO2
Mol. Mass.337.4553
SMILESOC(CN1C[C@@H]2C[C@H](Cc3ccccc3)C[C@@H]2C1)c1ccc(O)cc1