Reaction Details
TargetThyroid hormone receptor alpha
LigandBDBM18963
Substrate/CompetitorBDBM18860
Meas. Tech.TRalpha-Binding Assay.
pH7.6±n/a
Temperature295.15±n/a K
IC50 113000±57000 nM
Citation van Beeren, HCBakker, OWiersinga, WM Structure-function relationship of the inhibition of the 3,5,3'-triiodothyronine binding to the alpha1- and beta1-thyroid hormone receptor by amiodarone analogs. Endocrinology137:2807-14 (1996) 
 
Thyroid hormone receptor alpha
Name:Thyroid hormone receptor alpha
Type:Receptor
Mol. Mass.:46763.30
Organism:Gallus gallus (chicken)
Description:n/a
Residue:408
BDBM18963
BDBM18860
NameBDBM18963
Synonyms:4-[(2-butyl-1-benzofuran-3-yl)carbonyl]-2-iodophenol benzofuran derivative
TypeSmall organic molecule
Emp. Form.C19H17IO3
Mol. Mass.420.241
SMILESCCCCc1oc2ccccc2c1C(=O)c1ccc(O)c(I)c1