Reaction Details
TargetPhosphatidylinositol 4,5-bisphosphate 3-kinase catalytic subunit alpha isoform
LigandBDBM315561
Substrate/Competitorn/a
Meas. Tech.Inhibition Assay
IC50>500±n/a nM
Citation Ren, PLiu, YLi, LChan, KWilson, TE Kinase inhibitors and methods of use US Patent US9828378 Publication Date 11/28/2017
 
Phosphatidylinositol 4,5-bisphosphate 3-kinase catalytic subunit alpha isoform
Name:Phosphatidylinositol 4,5-bisphosphate 3-kinase catalytic subunit alpha isoform
Type:Enzyme Subunit
Mol. Mass.:124294.87
Organism:Homo sapiens (Human)
Description:P42336
Residue:1068
BDBM315561
NameBDBM315561
Synonyms:US10172858, Table 2.58 | US9828378, # 58
TypeSmall organic molecule
Emp. Form.C24H30N8O
Mol. Mass.446.548
SMILESCN1CCN(CC1)C1CCC(CC1)n1nc(-c2cc3cc(O)ccc3[nH]2)c2c(N)ncnc12