Reaction Details
TargetPhosphatidylinositol 4-phosphate 3-kinase C2 domain-containing subunit beta
LigandBDBM315564
Substrate/Competitorn/a
Meas. Tech.Inhibition Assay
IC50>500±n/a nM
Citation Ren, PLiu, YLi, LChan, KWilson, TE Kinase inhibitors and methods of use US Patent US9828378 Publication Date 11/28/2017
 
Phosphatidylinositol 4-phosphate 3-kinase C2 domain-containing subunit beta
Name:Phosphatidylinositol 4-phosphate 3-kinase C2 domain-containing subunit beta
Type:Enzyme
Mol. Mass.:184784.86
Organism:Homo sapiens (Human)
Description:O00750
Residue:1634
BDBM315564
NameBDBM315564
Synonyms:US10172858, Table 2.61 | US9828378, # 61
TypeSmall organic molecule
Emp. Form.C19H19ClN6O2
Mol. Mass.398.846
SMILESCOc1ccc(Cl)c2cc([nH]c12)-c1nn(C2CCOCC2)c2ncnc(N)c12