Reaction Details
TargetHistone deacetylase 6
LigandBDBM19151
Substrate/CompetitorBDBM19150
Meas. Tech.HDAC Enzyme Activity Assay
pH8±n/a
Temperature310.15±n/a K
IC50 787±24 nM
CommentsMCF7 cells growth inhibition, IC50=0.75 +/- 0.2 nM.HeLa nuclear HDACs inhibition, IC50=15 +/- 9 nM.
Citation Yurek-George, ACecil, ARMo, AHWen, SRogers, HHabens, FMaeda, SYoshida, MPackham, GGanesan, A The First Biologically Active Synthetic Analogues of FK228, the Depsipeptide Histone Deacetylase Inhibitor. J Med Chem50:5720-5726 (2007) 
 
Histone deacetylase 6
Name:Histone deacetylase 6
Type:PROTEIN
Mol. Mass.:125762.28
Organism:Mus musculus
Description:ChEMBL_1460074
Residue:1149
BDBM19151
BDBM19150
NameBDBM19151
Synonyms:(1S,4S,7Z,10S,16E,21R)-7-ethylidene-4,21-bis(propan-2-yl)-2-oxa-12,13-dithia-5,8,20,23-tetraazabicyclo[8.7.6]tricos-16-ene-3,6,9,19,22-pentone CHEMBL343448 FK228 | Romidepsin
TypeAntibiotic
Emp. Form.C24H36N4O6S2
Mol. Mass.540.696
SMILESC\C=C1/NC(=O)[C@H]2CSSCC\C=C\[C@H](CC(=O)N[C@H](C(C)C)C(=O)N2)OC(=O)[C@@H](NC1=O)C(C)C