Reaction Details
TargetHistone deacetylase 6
LigandBDBM19155
Substrate/CompetitorBDBM19150
Meas. Tech.HDAC Enzyme Activity Assay
pH8±n/a
Temperature310.15±n/a K
IC50>10000±n/a nM
CommentsMCF7 cells growth inhibition, IC50=55 +/- 11 nM.HeLa nuclear HDACs inhibition, IC50=242 nM.
Citation Yurek-George, ACecil, ARMo, AHWen, SRogers, HHabens, FMaeda, SYoshida, MPackham, GGanesan, A The First Biologically Active Synthetic Analogues of FK228, the Depsipeptide Histone Deacetylase Inhibitor. J Med Chem50:5720-5726 (2007) 
 
Histone deacetylase 6
Name:Histone deacetylase 6
Type:PROTEIN
Mol. Mass.:125762.28
Organism:Mus musculus
Description:ChEMBL_1460074
Residue:1149
BDBM19155
BDBM19150
NameBDBM19155
Synonyms:(6R,9S,12R,16R)-16-[(1E)-4-(acetylsulfanyl)but-1-en-1-yl]-9,12-dimethyl-6-(propan-2-yl)-1-oxa-4,7,10,13-tetraazacyclohexadecane-2,5,8,11,14-pentone | FK228 Analogue, 15b
TypeSmall organic molecule
Emp. Form.C22H34N4O7S
Mol. Mass.498.593
SMILESCC(C)[C@H]1NC(=O)[C@H](C)NC(=O)[C@@H](C)NC(=O)C[C@@H](OC(=O)CNC1=O)\C=C\CCSC(C)=O