Reaction Details
TargetHistone deacetylase 4
LigandBDBM19159
Substrate/CompetitorBDBM19150
Meas. Tech.HDAC Enzyme Activity Assay
pH8±n/a
Temperature310.15±n/a K
IC50 290±n/a nM
Citation Bhuiyan, MPKato, TOkauchi, TNishino, NMaeda, SNishino, TGYoshida, M Chlamydocin analogs bearing carbonyl group as possible ligand toward zinc atom in histone deacetylases. Bioorg Med Chem14:3438-46 (2006) 
 
Histone deacetylase 4
Name:Histone deacetylase 4
Type:Enzyme
Mol. Mass.:119049.39
Organism:Homo sapiens (Human)
Description:P56524
Residue:1084
BDBM19159
BDBM19150
NameBDBM19159
Synonyms:(3S,9S,14aR)-9-benzyl-6,6-dimethyl-3-(6-oxoheptyl)-tetradecahydropyrrolo[1,2-a][,,,]cyclododecane-1,4,7,10-tetrone | chlamydocin-methylketone analog, 5
TypeSmall organic molecule
Emp. Form.C27H38N4O5
Mol. Mass.498.6144
SMILESCC(=O)CCCCC[C@@H]1NC(=O)[C@H]2CCCN2C(=O)[C@H](Cc2ccccc2)NC(=O)C(C)(C)NC1=O