Reaction Details
TargetEstrogen receptor
LigandBDBM361415
Substrate/Competitorn/a
Meas. Tech.MCF-7 ER Down-Regulation Assay
IC50 0.120±n/a nM
Citation Nissink, JWScott, JSMoss, TAHughes, SJBarlaam, BCYang, B Chemical compounds US Patent US10221173 Publication Date 3/5/2019
 
Estrogen receptor
Name:Estrogen receptor
Type:Protein
Mol. Mass.:66230.44
Organism:Homo sapiens (Human)
Description:P03372
Residue:595
BDBM361415
NameBDBM361415
Synonyms:3-Fluoro-N-(2-(4-methoxy-3-((1R,3R)-3-methyl-2-(2,2,2-trifluoroethyl)-2,3,4,9-tetrahydro-1H-pyrido[3,4-b]indol-1-yl)phenoxy)ethyl)propan-1-amine US10590132, Example 7 | US11046689, Example 7
TypeSmall organic molecule
Emp. Form.C26H31F4N3O2
Mol. Mass.493.5369
SMILESCOc1ccc(OCCNCCCF)cc1[C@H]1N(CC(F)(F)F)[C@H](C)Cc2c1[nH]c1ccccc21