Reaction Details
TargetEstrogen receptor
LigandBDBM361453
Substrate/Competitorn/a
Meas. Tech.MCF-7 ER Down-Regulation Assay
IC50 0.034±n/a nM
Citation Nissink, JWScott, JSMoss, TAHughes, SJBarlaam, BCYang, B Chemical compounds US Patent US10221173 Publication Date 3/5/2019
 
Estrogen receptor
Name:Estrogen receptor
Type:Protein
Mol. Mass.:66230.44
Organism:Homo sapiens (Human)
Description:P03372
Residue:595
BDBM361453
NameBDBM361453
Synonyms:2,2-difluoro-3- ((1R,3R)-1-(6- fluoro-3-(2- ((3- fluoropropyl) amino)ethoxy)- 2- methylphenyl)- 3-methyl- 1,3,4,9- tetrahydro-2H- pyrido[3,4- b]indol-2- yl)propan-1-ol US10590132, Example 45 | US11046689, Example 45
TypeSmall organic molecule
Emp. Form.C27H33F4N3O2
Mol. Mass.507.5634
SMILESC[C@@H]1Cc2c([nH]c3ccccc23)[C@H](N1CC(F)(F)CO)c1c(F)ccc(OCCNCCCF)c1C