Reaction Details
TargetEstrogen receptor
LigandBDBM361468
Substrate/Competitorn/a
Meas. Tech.MCF-7 ER Down-Regulation Assay
IC50 0.120±n/a nM
Citation Nissink, JWScott, JSMoss, TAHughes, SJBarlaam, BCYang, B Chemical compounds US Patent US10221173 Publication Date 3/5/2019
 
Estrogen receptor
Name:Estrogen receptor
Type:Protein
Mol. Mass.:66230.44
Organism:Homo sapiens (Human)
Description:P03372
Residue:595
BDBM361468
NameBDBM361468
Synonyms:3-((1R,3R)-1- (2,6-difluoro- 3-(2-((3- fluoropropyl) amino)ethoxy) phenyl)-8- fluoro-3- methyl- 1,3,4,9- tetrahydro-2H- pyrido[3,4- b]indol-2-yl)- 2,2- difluoropropan-1- ol US10590132, Example 60 | US11046689, Example 60
TypeSmall organic molecule
Emp. Form.C26H29F6N3O2
Mol. Mass.529.5178
SMILESC[C@@H]1Cc2c([nH]c3c(F)cccc23)[C@H](N1CC(F)(F)CO)c1c(F)ccc(OCCNCCCF)c1F