Reaction Details
TargetEstrogen receptor
LigandBDBM361472
Substrate/Competitorn/a
Meas. Tech.MCF-7 ER Down-Regulation Assay
IC50 0.071±n/a nM
Citation Nissink, JWScott, JSMoss, TAHughes, SJBarlaam, BCYang, B Chemical compounds US Patent US10221173 Publication Date 3/5/2019
 
Estrogen receptor
Name:Estrogen receptor
Type:Protein
Mol. Mass.:66230.44
Organism:Homo sapiens (Human)
Description:P03372
Residue:595
BDBM361472
NameBDBM361472
Synonyms:3-((1R,3R)-1- (3,5-difluoro- 2-(2-((3- fluoropropyl) amino)ethoxy) pyridin-4-yl)-3- methyl- 1,3,4,9- tetrahydro-2H- pyrido[3,4- b]indol-2-yl)- 2,2- difluoropropan-1- ol US10590132, Example 64 | US11046689, Example 64
TypeSmall organic molecule
Emp. Form.C25H29F5N4O2
Mol. Mass.512.5154
SMILESC[C@@H]1Cc2c([nH]c3ccccc23)[C@H](N1CC(F)(F)CO)c1c(F)cnc(OCCNCCCF)c1F