Reaction Details
TargetTransient receptor potential cation channel subfamily A member 1
LigandBDBM361651
Substrate/Competitorn/a
Meas. Tech.Measuring Inhibition of the TRPA1 Ion Channel
IC50 1.000±n/a nM
Citation Chenard, BLWu, X Inhibiting the transient receptor potential A1 ion channel US Patent US10221177 Publication Date 3/5/2019
 
Transient receptor potential cation channel subfamily A member 1
Name:Transient receptor potential cation channel subfamily A member 1
Type:Protein
Mol. Mass.:127514.20
Organism:Homo sapiens (Human)
Description:O75762
Residue:1119
BDBM361651
NameBDBM361651
Synonyms:US10221177, Compound 14 | US10221177, Compound 270
TypeSmall organic molecule
Emp. Form.C25H27N9O4S
Mol. Mass.549.605
SMILESCCC(=O)Cn1c(=O)n(C)c2ncn([C@@H](C)C(=O)Nc3csc(n3)-c3cnc(nc3)N3CC4CC4C3)c2c1=O