Reaction Details
TargetTransient receptor potential cation channel subfamily A member 1
LigandBDBM361664
Substrate/Competitorn/a
Meas. Tech.Measuring Inhibition of the TRPA1 Ion Channel
IC50 2.00±n/a nM
Citation Chenard, BLWu, X Inhibiting the transient receptor potential A1 ion channel US Patent US10221177 Publication Date 3/5/2019
 
Transient receptor potential cation channel subfamily A member 1
Name:Transient receptor potential cation channel subfamily A member 1
Type:Protein
Mol. Mass.:127514.20
Organism:Homo sapiens (Human)
Description:O75762
Residue:1119
BDBM361664
NameBDBM361664
Synonyms:US10221177, Compound 27
TypeSmall organic molecule
Emp. Form.C27H30N10O4
Mol. Mass.558.5917
SMILESCCN(CC)c1ncc(cn1)-c1cccc(NC(=O)[C@H](C)n2cnc3n(C)c(=O)n(Cc4cc(C)on4)c(=O)c23)n1