Reaction Details
TargetTransient receptor potential cation channel subfamily A member 1
LigandBDBM361671
Substrate/Competitorn/a
Meas. Tech.Measuring Inhibition of the TRPA1 Ion Channel
IC50 1.000±n/a nM
Citation Chenard, BLWu, X Inhibiting the transient receptor potential A1 ion channel US Patent US10221177 Publication Date 3/5/2019
 
Transient receptor potential cation channel subfamily A member 1
Name:Transient receptor potential cation channel subfamily A member 1
Type:Protein
Mol. Mass.:127514.20
Organism:Homo sapiens (Human)
Description:O75762
Residue:1119
BDBM361671
NameBDBM361671
Synonyms:US10221177, Compound 34
TypeSmall organic molecule
Emp. Form.C23H22N10O3S
Mol. Mass.518.551
SMILESC[C@@H](C(=O)Nc1csc(n1)-c1cnc(nc1)N1CC2CC2C1)n1cnc2n(C)c(=O)n(CC#N)c(=O)c12