Reaction Details
TargetTransient receptor potential cation channel subfamily A member 1
LigandBDBM361695
Substrate/Competitorn/a
Meas. Tech.Measuring Inhibition of the TRPA1 Ion Channel
IC50 2.00±n/a nM
Citation Chenard, BLWu, X Inhibiting the transient receptor potential A1 ion channel US Patent US10221177 Publication Date 3/5/2019
 
Transient receptor potential cation channel subfamily A member 1
Name:Transient receptor potential cation channel subfamily A member 1
Type:Protein
Mol. Mass.:127514.20
Organism:Homo sapiens (Human)
Description:O75762
Residue:1119
BDBM361695
NameBDBM361695
Synonyms:US10221177, Compound 58
TypeSmall organic molecule
Emp. Form.C23H20F2N10O3S
Mol. Mass.554.532
SMILESC[C@@H](C(=O)Nc1csc(n1)-c1cnc(nc1)N1CC2C(C1)C2(F)F)n1cnc2n(C)c(=O)n(CC#N)c(=O)c12