Reaction Details
TargetTransient receptor potential cation channel subfamily A member 1
LigandBDBM361744
Substrate/Competitorn/a
Meas. Tech.Measuring Inhibition of the TRPA1 Ion Channel
IC50 1.000±n/a nM
Citation Chenard, BLWu, X Inhibiting the transient receptor potential A1 ion channel US Patent US10221177 Publication Date 3/5/2019
 
Transient receptor potential cation channel subfamily A member 1
Name:Transient receptor potential cation channel subfamily A member 1
Type:Protein
Mol. Mass.:127514.20
Organism:Homo sapiens (Human)
Description:O75762
Residue:1119
BDBM361744
NameBDBM361744
Synonyms:US10221177, Compound 107 | US10221177, Compound 108
TypeSmall organic molecule
Emp. Form.C13H15N7O4
Mol. Mass.333.3027
SMILESC[C@@H](C(N)=O)n1cnc2n(C)c(=O)n(Cc3nc(C)no3)c(=O)c12