Reaction Details
TargetTransient receptor potential cation channel subfamily A member 1
LigandBDBM361749
Substrate/Competitorn/a
Meas. Tech.Measuring Inhibition of the TRPA1 Ion Channel
IC50 1.000±n/a nM
Citation Chenard, BLWu, X Inhibiting the transient receptor potential A1 ion channel US Patent US10221177 Publication Date 3/5/2019
 
Transient receptor potential cation channel subfamily A member 1
Name:Transient receptor potential cation channel subfamily A member 1
Type:Protein
Mol. Mass.:127514.20
Organism:Homo sapiens (Human)
Description:O75762
Residue:1119
BDBM361749
NameBDBM361749
Synonyms:US10221177, Compound 112
TypeSmall organic molecule
Emp. Form.C24H21F3N8O4S
Mol. Mass.574.535
SMILESC[C@@H](C(=O)Nc1csc(n1)-c1cnc(C)c(c1)C(F)(F)F)n1cnc2n(C)c(=O)n(Cc3cc(C)on3)c(=O)c12