Reaction Details
TargetTransient receptor potential cation channel subfamily A member 1
LigandBDBM361822
Substrate/Competitorn/a
Meas. Tech.Measuring Inhibition of the TRPA1 Ion Channel
IC50 2.00±n/a nM
Citation Chenard, BLWu, X Inhibiting the transient receptor potential A1 ion channel US Patent US10221177 Publication Date 3/5/2019
 
Transient receptor potential cation channel subfamily A member 1
Name:Transient receptor potential cation channel subfamily A member 1
Type:Protein
Mol. Mass.:127514.20
Organism:Homo sapiens (Human)
Description:O75762
Residue:1119
BDBM361822
NameBDBM361822
Synonyms:US10221177, Compound 189
TypeSmall organic molecule
Emp. Form.C28H25F3N10O3
Mol. Mass.606.5585
SMILESCn1c2ncn(CC(=O)Nc3cccc(n3)-c3cnc(nc3)N3CCC[C@H]3C(F)(F)F)c2c(=O)n(Cc2ccccn2)c1=O