Reaction Details
TargetTransient receptor potential cation channel subfamily A member 1
LigandBDBM361878
Substrate/Competitorn/a
Meas. Tech.Measuring Inhibition of the TRPA1 Ion Channel
IC50 1.000±n/a nM
Citation Chenard, BLWu, X Inhibiting the transient receptor potential A1 ion channel US Patent US10221177 Publication Date 3/5/2019
 
Transient receptor potential cation channel subfamily A member 1
Name:Transient receptor potential cation channel subfamily A member 1
Type:Protein
Mol. Mass.:127514.20
Organism:Homo sapiens (Human)
Description:O75762
Residue:1119
BDBM361878
NameBDBM361878
Synonyms:US10221177, Compound 252
TypeSmall organic molecule
Emp. Form.C22H18F3N9O4S
Mol. Mass.561.496
SMILESCc1noc(Cn2c(=O)n(C)c3ncn(CC(=O)Nc4csc(n4)-c4cnc(C)c(c4)C(F)(F)F)c3c2=O)n1