Reaction Details
TargetC-X-C chemokine receptor type 2
LigandBDBM362193
Substrate/Competitorn/a
Meas. Tech.FLIPR-3 Calcium Assay
IC50 32.0±2 nM
Citation Maeda, DYZebala, JA Pyridinecarboxamides as CXCR2 modulators US Patent US Patent
 
C-X-C chemokine receptor type 2
Name:C-X-C chemokine receptor type 2
Type:Protein
Mol. Mass.:40767.88
Organism:Homo sapiens (Human)
Description:P25025
Residue:360
BDBM362193
NameBDBM362193
Synonyms:USRE47267, Compound 168
TypeSmall organic molecule
Emp. Form.C19H16BFN2O4
Mol. Mass.366.151
SMILESOB(O)c1ccccc1COc1ccc(cn1)C(=O)Nc1ccc(F)cc1