Reaction Details
TargetCalcitonin gene-related peptide type 1 receptor
LigandBDBM362175
Substrate/Competitorn/a
Meas. Tech.Receptor Functional Assay
Ki 0.093±n/a nM
Citation Bell, IMFraley, MEGallicchio, SNGinnetti, AMitchell, HJPaone, DVStaas, DDWang, CZartman, CB Piperidinone carboxamide azaindane CGRP receptor antagonists US Patent US9833448 Publication Date 12/5/2017
 
Calcitonin gene-related peptide type 1 receptor
Name:Calcitonin gene-related peptide type 1 receptor
Type:Enzyme Catalytic Domain
Mol. Mass.:52980.45
Organism:Homo sapiens (Human)
Description:Q16602
Residue:461
BDBM362175
NameBDBM362175
Synonyms:US10272077, Example 26 | US9833448, Example 26
TypeSmall organic molecule
Emp. Form.C32H30F3N5O3
Mol. Mass.589.6075
SMILESC[C@@H]1[C@@H](C[C@H](NC(=O)c2cnc3C[C@]4(Cc3c2)C(=O)Nc2ncccc42)C(=O)N1CC1(CC1)C(F)(F)F)c1ccccc1