Reaction Details
TargetProcathepsin L
LigandBDBM19559
Substrate/CompetitorBDBM19584
Meas. Tech.Enzyme Inhibition Assay
Ki 23±n/a nM
Citation Liu, HTully, DCEpple, RBursulaya, BLi, JHarris, JLWilliams, JARusso, RTumanut, CRoberts, MJAlper, PBHe, YKaranewsky, DS Design and synthesis of arylaminoethyl amides as noncovalent inhibitors of cathepsin S. Part 1. Bioorg Med Chem Lett15:4979-84 (2005) 
 
Procathepsin L
Name:Procathepsin L
Type:Enzyme
Mol. Mass.:37557.19
Organism:Homo sapiens (Human)
Description:Purchased from Calbiochem (San Diego, CA).
Residue:333
BDBM19559
BDBM19584
NameBDBM19559
Synonyms:(2S)-3-(4-acetamidophenyl)-N-{2-[(4-methoxyphenyl)amino]ethyl}-2-[(3-methylphenyl)formamido]propanamide | arylaminoethyl amide, 5m
TypeSmall organic molecule
Emp. Form.C28H32N4O4
Mol. Mass.488.5781
SMILESCOc1ccc(NCCNC(=O)[C@H](Cc2ccc(NC(C)=O)cc2)NC(=O)c2cccc(C)c2)cc1