Reaction Details
TargetProcathepsin L
LigandBDBM19565
Substrate/CompetitorBDBM19584
Meas. Tech.Enzyme Inhibition Assay
Ki 7.2±n/a nM
Citation Liu, HTully, DCEpple, RBursulaya, BLi, JHarris, JLWilliams, JARusso, RTumanut, CRoberts, MJAlper, PBHe, YKaranewsky, DS Design and synthesis of arylaminoethyl amides as noncovalent inhibitors of cathepsin S. Part 1. Bioorg Med Chem Lett15:4979-84 (2005) 
 
Procathepsin L
Name:Procathepsin L
Type:Enzyme
Mol. Mass.:37557.19
Organism:Homo sapiens (Human)
Description:Purchased from Calbiochem (San Diego, CA).
Residue:333
BDBM19565
BDBM19584
NameBDBM19565
Synonyms:(2S)-3-(1H-indol-2-yl)-N-{2-[(4-methoxyphenyl)amino]ethyl}-2-[(3-methylphenyl)formamido]propanamide | arylaminoethyl amide, 5s
TypeSmall organic molecule
Emp. Form.C28H30N4O3
Mol. Mass.470.5628
SMILESCOc1ccc(NCCNC(=O)[C@H](Cc2cc3ccccc3[nH]2)NC(=O)c2cccc(C)c2)cc1