Reaction Details
TargetCathepsin S
LigandBDBM19591
Substrate/CompetitorBDBM19546
Meas. Tech.Enzyme Inhibition Assay
pH5.5±n/a
Temperature310.15±n/a K
Ki 196±n/a nM
Citation Alper, PBLiu, HChatterjee, AKNguyen, KTTully, DCTumanut, CLi, JHarris, JLTuntland, TChang, JGordon, PHollenbeck, TKaranewsky, DS Arylaminoethyl amides as noncovalent inhibitors of cathepsin S. Part 2: Optimization of P1 and N-aryl. Bioorg Med Chem Lett16:1486-90 (2006) 
 
Cathepsin S
Name:Cathepsin S
Type:Protein
Mol. Mass.:37507.38
Organism:Homo sapiens (Human)
Description:P25774
Residue:331
BDBM19591
BDBM19546
NameBDBM19591
Synonyms:(2S)-N-[2-(5-chloro-2,3-dihydro-1H-indol-1-yl)ethyl]-4-methyl-2-[(3-methylphenyl)formamido]pentanamide | arylaminoethyl amide, 3g
TypeSmall organic molecule
Emp. Form.C24H30ClN3O2
Mol. Mass.427.967
SMILESCC(C)C[C@H](NC(=O)c1cccc(C)c1)C(=O)NCCN1CCc2cc(Cl)ccc12