Reaction Details
TargetCathepsin K
LigandBDBM19592
Substrate/CompetitorBDBM19583
Meas. Tech.Enzyme Inhibition Assay
Ki 80±n/a nM
Citation Alper, PBLiu, HChatterjee, AKNguyen, KTTully, DCTumanut, CLi, JHarris, JLTuntland, TChang, JGordon, PHollenbeck, TKaranewsky, DS Arylaminoethyl amides as noncovalent inhibitors of cathepsin S. Part 2: Optimization of P1 and N-aryl. Bioorg Med Chem Lett16:1486-90 (2006) 
 
Cathepsin K
Name:Cathepsin K
Type:Enzyme
Mol. Mass.:36975.68
Organism:Homo sapiens (Human)
Description:P43235
Residue:329
BDBM19592
BDBM19583
NameBDBM19592
Synonyms:(2S)-N-[2-(5-fluoro-2,3-dihydro-1H-indol-1-yl)ethyl]-4-methyl-2-[(3-methylphenyl)formamido]pentanamide | arylaminoethyl amide, 3h
TypeSmall organic molecule
Emp. Form.C24H30FN3O2
Mol. Mass.411.5123
SMILESCC(C)C[C@H](NC(=O)c1cccc(C)c1)C(=O)NCCN1CCc2cc(F)ccc12