Reaction Details
TargetCathepsin K
LigandBDBM19610
Substrate/CompetitorBDBM19583
Meas. Tech.Enzyme Inhibition Assay
Ki 55±n/a nM
Citation Alper, PBLiu, HChatterjee, AKNguyen, KTTully, DCTumanut, CLi, JHarris, JLTuntland, TChang, JGordon, PHollenbeck, TKaranewsky, DS Arylaminoethyl amides as noncovalent inhibitors of cathepsin S. Part 2: Optimization of P1 and N-aryl. Bioorg Med Chem Lett16:1486-90 (2006) 
 
Cathepsin K
Name:Cathepsin K
Type:Enzyme
Mol. Mass.:36975.68
Organism:Homo sapiens (Human)
Description:P43235
Residue:329
BDBM19610
BDBM19583
NameBDBM19610
Synonyms:(2S)-N-[(2S)-1-[(4-methoxyphenyl)amino]propan-2-yl]-4-methyl-2-[(3-methylphenyl)formamido]pentanamide | arylaminoethyl amide, 7a
TypeSmall organic molecule
Emp. Form.C24H33N3O3
Mol. Mass.411.5371
SMILESCOc1ccc(NC[C@H](C)NC(=O)[C@H](CC(C)C)NC(=O)c2cccc(C)c2)cc1