Reaction Details
TargetCathepsin K
LigandBDBM19604
Substrate/CompetitorBDBM19583
Meas. Tech.Enzyme Inhibition Assay
Ki 47±n/a nM
Citation Alper, PBLiu, HChatterjee, AKNguyen, KTTully, DCTumanut, CLi, JHarris, JLTuntland, TChang, JGordon, PHollenbeck, TKaranewsky, DS Arylaminoethyl amides as noncovalent inhibitors of cathepsin S. Part 2: Optimization of P1 and N-aryl. Bioorg Med Chem Lett16:1486-90 (2006) 
 
Cathepsin K
Name:Cathepsin K
Type:Enzyme
Mol. Mass.:36975.68
Organism:Homo sapiens (Human)
Description:P43235
Residue:329
BDBM19604
BDBM19583
NameBDBM19604
Synonyms:(2S)-N-[(2S)-1-(5-fluoro-2,3-dihydro-1H-indol-1-yl)-4-methanesulfonylbutan-2-yl]-2-[(3-methoxyphenyl)formamido]-4,4-dimethylpentanamide | arylaminoethyl amide, 8l
TypeSmall organic molecule
Emp. Form.C28H38FN3O5S
Mol. Mass.547.682
SMILESCOc1cccc(c1)C(=O)N[C@@H](CC(C)(C)C)C(=O)N[C@@H](CCS(C)(=O)=O)CN1CCc2cc(F)ccc12