Reaction Details
TargetProcathepsin L
LigandBDBM19585
Substrate/CompetitorBDBM19584
Meas. Tech.Enzyme Inhibition Assay
Ki 20±n/a nM
Citation Alper, PBLiu, HChatterjee, AKNguyen, KTTully, DCTumanut, CLi, JHarris, JLTuntland, TChang, JGordon, PHollenbeck, TKaranewsky, DS Arylaminoethyl amides as noncovalent inhibitors of cathepsin S. Part 2: Optimization of P1 and N-aryl. Bioorg Med Chem Lett16:1486-90 (2006) 
 
Procathepsin L
Name:Procathepsin L
Type:Enzyme
Mol. Mass.:37557.19
Organism:Homo sapiens (Human)
Description:Purchased from Calbiochem (San Diego, CA).
Residue:333
BDBM19585
BDBM19584
NameBDBM19585
Synonyms:(2S)-N-{2-[(4-methoxy-3,5-dimethylphenyl)amino]ethyl}-4-methyl-2-[(3-methylphenyl)formamido]pentanamide | arylaminoethyl amide, 3a
TypeSmall organic molecule
Emp. Form.C25H35N3O3
Mol. Mass.425.5637
SMILESCOc1c(C)cc(NCCNC(=O)[C@H](CC(C)C)NC(=O)c2cccc(C)c2)cc1C