Reaction Details
TargetProcathepsin L
LigandBDBM19588
Substrate/CompetitorBDBM19584
Meas. Tech.Enzyme Inhibition Assay
Ki 92±n/a nM
Citation Alper, PBLiu, HChatterjee, AKNguyen, KTTully, DCTumanut, CLi, JHarris, JLTuntland, TChang, JGordon, PHollenbeck, TKaranewsky, DS Arylaminoethyl amides as noncovalent inhibitors of cathepsin S. Part 2: Optimization of P1 and N-aryl. Bioorg Med Chem Lett16:1486-90 (2006) 
 
Procathepsin L
Name:Procathepsin L
Type:Enzyme
Mol. Mass.:37557.19
Organism:Homo sapiens (Human)
Description:Purchased from Calbiochem (San Diego, CA).
Residue:333
BDBM19588
BDBM19584
NameBDBM19588
Synonyms:(2S)-N-{2-[(4-chlorophenyl)amino]ethyl}-4-methyl-2-[(3-methylphenyl)formamido]pentanamide | arylaminoethyl amide, 3d
TypeSmall organic molecule
Emp. Form.C22H28ClN3O2
Mol. Mass.401.93
SMILESCC(C)C[C@H](NC(=O)c1cccc(C)c1)C(=O)NCCNc1ccc(Cl)cc1