Reaction Details
TargetTyrosine-protein kinase BTK
LigandBDBM362420
Substrate/Competitorn/a
Meas. Tech.Enzyme Activity Assay
IC50 0.870±n/a nM
Citation Liu, JKim, RMKozlowski, JGuiadeen, DKrikorian, ADYu, Y BTK inhibitors US Patent US9834554 Publication Date 12/5/2017
 
Tyrosine-protein kinase BTK
Name:Tyrosine-protein kinase BTK
Type:Enzyme
Mol. Mass.:76289.95
Organism:Homo sapiens (Human)
Description:Q06187
Residue:659
BDBM362420
NameBDBM362420
Synonyms:US9834554, Example 34
TypeSmall organic molecule
Emp. Form.C32H34N6O3
Mol. Mass.550.6508
SMILESC[C@H]1CC[C@H](CN1C(=O)C1CC1)c1nn(-c2ccc(cc2)C(=O)Nc2cccc(OC3CC3)c2)c2c(N)nccc12