Reaction Details
TargetSodium channel protein type 9 subunit alpha
LigandBDBM258113
Substrate/Competitorn/a
Meas. Tech.Electrophysiological Assay
IC50 28.0±n/a nM
Citation Shinozuka, TKobayashi, HSuzuki, STanaka, KKimoto, HDomon, Y Cycloalkane derivatives US Patent US9845313 Publication Date 12/19/2017
 
Sodium channel protein type 9 subunit alpha
Name:Sodium channel protein type 9 subunit alpha
Type:Protein
Mol. Mass.:226375.97
Organism:Homo sapiens (Human)
Description:Q15858
Residue:1988
BDBM258113
NameBDBM258113
Synonyms:US9493448, 15 | US9845313, Example 15
TypeSmall organic molecule
Emp. Form.C18H18F2N4O3S2
Mol. Mass.440.487
SMILESCn1nccc1[C@H]1CCC[C@@H]1Oc1cc(F)c(cc1F)S(=O)(=O)Nc1nccs1