Reaction Details
TargetSodium channel protein type 9 subunit alpha
LigandBDBM258164
Substrate/Competitorn/a
Meas. Tech.Electrophysiological Assay
IC50 17.0±n/a nM
Citation Shinozuka, TKobayashi, HSuzuki, STanaka, KKimoto, HDomon, Y Cycloalkane derivatives US Patent US9845313 Publication Date 12/19/2017
 
Sodium channel protein type 9 subunit alpha
Name:Sodium channel protein type 9 subunit alpha
Type:Protein
Mol. Mass.:226375.97
Organism:Homo sapiens (Human)
Description:Q15858
Residue:1988
BDBM258164
NameBDBM258164
Synonyms:US9493448, 66 | US9845313, Example 66
TypeSmall organic molecule
Emp. Form.C21H24FN5O3S
Mol. Mass.445.51
SMILESCc1c(O[C@H]2CCCC[C@@H]2c2ccnn2C)ccc(c1F)S(=O)(=O)Nc1ccncn1