Reaction Details
TargetProcathepsin L
LigandBDBM19855
Substrate/CompetitorBDBM19480
Meas. Tech.Enzyme Inhibition Assay and Whole Cell Enzyme Occupancy Assay
pH5.5±n/a
Temperature295.15±n/a K
IC50 503±80 nM
EC50 48±15 nM
Citation Falgueyret, JPDesmarais, SOballa, RBlack, WCCromlish, WKhougaz, KLamontagne, SMassé, FRiendeau, DToulmond, SPercival, MD Lysosomotropism of basic cathepsin K inhibitors contributes to increased cellular potencies against off-target cathepsins and reduced functional selectivity. J Med Chem48:7535-43 (2005) 
 
Procathepsin L
Name:Procathepsin L
Type:Enzyme
Mol. Mass.:37557.19
Organism:Homo sapiens (Human)
Description:Purchased from Calbiochem (San Diego, CA).
Residue:333
BDBM19855
BDBM19480
NameBDBM19855
Synonyms:Balicatib N-[1-(cyanomethylcarbamoyl)cyclohexyl]-4-(4-propylpiperazin-1-yl) basic piperazine-containing compound, 10
TypeSmall organic molecule
Emp. Form.C23H33N5O2
Mol. Mass.411.5404
SMILESCCCN1CCN(CC1)c1ccc(cc1)C(=O)NC1(CCCCC1)C(=O)NCC#N