Reaction Details
TargetProcathepsin L
LigandBDBM19856
Substrate/CompetitorBDBM19480
Meas. Tech.Enzyme Inhibition Assay and Whole Cell Enzyme Occupancy Assay
pH5.5±n/a
Temperature295.15±n/a K
IC50 2600±250 nM
EC50 320±170 nM
Citation Falgueyret, JPDesmarais, SOballa, RBlack, WCCromlish, WKhougaz, KLamontagne, SMassé, FRiendeau, DToulmond, SPercival, MD Lysosomotropism of basic cathepsin K inhibitors contributes to increased cellular potencies against off-target cathepsins and reduced functional selectivity. J Med Chem48:7535-43 (2005) 
 
Procathepsin L
Name:Procathepsin L
Type:Enzyme
Mol. Mass.:37557.19
Organism:Homo sapiens (Human)
Description:Purchased from Calbiochem (San Diego, CA).
Residue:333
BDBM19856
BDBM19480
NameBDBM19856
Synonyms:(2R)-N-(cyanomethyl)-4-methyl-2-{3-[4-(piperazin-1-yl)phenyl]phenyl}pentanamide JMC463709 (R)-2 | piperazine-containing compound, 11
TypeSmall organic molecule
Emp. Form.C24H30N4O
Mol. Mass.390.5212
SMILESCC(C)C[C@@H](C(=O)NCC#N)c1cccc(c1)-c1ccc(cc1)N1CCNCC1