Reaction Details
TargetProcathepsin L
LigandBDBM19859
Substrate/CompetitorBDBM19480
Meas. Tech.Enzyme Inhibition Assay and Whole Cell Enzyme Occupancy Assay
pH5.5±n/a
Temperature295.15±n/a K
IC50 55±11 nM
EC50 230±180 nM
Citation Falgueyret, JPDesmarais, SOballa, RBlack, WCCromlish, WKhougaz, KLamontagne, SMassé, FRiendeau, DToulmond, SPercival, MD Lysosomotropism of basic cathepsin K inhibitors contributes to increased cellular potencies against off-target cathepsins and reduced functional selectivity. J Med Chem48:7535-43 (2005) 
 
Procathepsin L
Name:Procathepsin L
Type:Enzyme
Mol. Mass.:37557.19
Organism:Homo sapiens (Human)
Description:Purchased from Calbiochem (San Diego, CA).
Residue:333
BDBM19859
BDBM19480
NameBDBM19859
Synonyms:(2S)-N-(cyanomethyl)-3-cyclohexyl-2-(phenylformamido)propanamide | phenyl-containing analogue, 14
TypeSmall organic molecule
Emp. Form.C18H23N3O2
Mol. Mass.313.3941
SMILESO=C(NCC#N)[C@H](CC1CCCCC1)NC(=O)c1ccccc1